hydrOntology
type: Ontology
creator: Luis Manuel Vilches-Blázquez
version info: v0.2
publisher: Ontology Engineering Group @en
comment: Ontología global de dominio sobre fenómenos hidrográficos
imports: top.owl

desagua en
type: ObjectProperty
comment: Dicho de un río que vierte sus agua a otro río
range: Aguas
domain: Class
  union of: Aguas corrientes naturales
  union of: Aguas de transición
  union of: Aguas artificiales
  union of: Desembocadura

desembocaEn
type: ObjectProperty
comment: Dicho de unas aguas corrientes que vierten sus aguas al mar
range: Aguas marinas
sub property of: desagua en
domain: Class
  union of: Canal marino
  union of: Curso de agua principal

localizadoEn
type: ObjectProperty
comment: localizado en
range: territory
domain: Accidente hidrografico

altitud
type: DatatypeProperty
comment: tabla segmentoLago columna Altitud_CEDEX
domain: Cascada
range: float

aportacion
type: DatatypeProperty
see also: {"epigenico", "hipogenico", "mixto", "otros"}
domain: Aguas corrientes
domain: Aguas quietas

categoria
type: DatatypeProperty
domain: Agua freatica
range: Datatype
  one of: confinado
  one of: desconocido
  one of: libre
  one of: predominantemente confinado
  one of: predominantemente libre

cauce
type: DatatypeProperty
comment: Tabla SegmentoRio columna tipoCauce
domain: Aguas corrientes naturales
range: Datatype
  one of: alterado o no clasificable
  one of: anastomosado
  one of: meandriforme de pendiente baja
  one of: meandriforme de pendiente media
  one of: pendiente
  one of: recto
  one of: sinuoso de pendiente alta
  one of: sinuoso de pendiente media y baja
  one of: trenzado de pendiente alta
  one of: trenzado de pendiente baja

concentracion de sal
type: DatatypeProperty
comment: tabla segmentoLago columna Salinidad
domain: Aguas marinas
domain: Aguas saladas
range: Datatype
  one of: constante alta (> 8000 microsiemens/cm)
  one of: constante baja (< 800 microsiemens/cm)
  one of: constante media
  one of: desconocido
  one of: sin catalogar
  one of: variable

conexion
type: DatatypeProperty
comment: en tabla masaSubterranea_intrinsecas correspondiente con columnas Conexion CursoAgua y Conexion Lago
domain: Agua freatica
range: string

distancia
type: DatatypeProperty
domain: Aguas marinas
range: Datatype
  one of: 1 milla
  one of: 12 millas
  one of: 200 millas
  one of: 24 millas
  one of: mas de 200 millas

drenaje
type: DatatypeProperty
domain: Aguas quietas
range: Datatype
  one of: abierto mixto
  one of: abierto subterraneo
  one of: abierto superficial
  one of: cerrado
  one of: desconocido
  one of: mixto
  one of: sin catalogar

estado
type: DatatypeProperty
domain: Aguas
range: Datatype
  one of: liquido
  one of: solido

explotacion
type: DatatypeProperty
comment: tabla MasaSubterranea_Presiones columna Explotacion
domain: Acuífero

geologia
type: DatatypeProperty
domain: Aguas quietas
range: Datatype
  one of: agua
  one of: desconocido
  one of: rocas carbonatadas
  one of: rocas evaporiticas
  one of: rocas mixtas carbonatado-evaporiticas
  one of: rocas mixtas siliceo-carbonatadas
  one of: rocas mixtas siliceo-carbonatado-evaporiticas
  one of: rocas siliceas

grado de contaminacion
type: DatatypeProperty
comment: tabla MasaSubterranea_Presiones columna Contaminacion Putnaul
domain: Agua freatica
range: string

grado de intervencion
type: DatatypeProperty
domain: Aguas quietas
range: Datatype
  one of: alto, esencial en la funcionalidad actual
  one of: bajo, no afecta a la funcionalidad
  one of: desconocido
  one of: medio, afecta algo
  one of: sin catalogar

horizon
type: DatatypeProperty
source: Diccionario Geologico http://www.estrucplan.com.ar/Producciones/entrega.asp?IdEntrega=1684
source: Wordnet http://wordnet.princeton.edu/perl/webwn?o2=&o0=1&o7=&o5=&o1=1&o6=&o4=&o3=&s=horizon&i=2&h=0000#c
comment: a specific layer or stratum of soil or subsoil in a vertical cross section of land)
comment: capa del suelo mas o menos paralela a la superficie con caracteristicas especificas con respecto a las situadas encima y debajo: espesor, color, caracteristicas quimicas, biologicas y mineralogicas. El conjunto de horizontes constituye el perfil del suelo.
domain: Agua freatica
range: Datatype
  one of: A
  one of: B

mezcla
type: DatatypeProperty
domain: Aguas quietas
range: Datatype
  one of: dimictico
  one of: monomictico calido
  one of: monomictico frio
  one of: otros
  one of: polimictico

navegable
type: DatatypeProperty
domain: Aguas
range: Datatype
  one of: desconocido
  one of: no
  one of: si

ocupacion
type: DatatypeProperty
domain: Agua freatica
range: Datatype
  one of: agricola
  one of: agua
  one of: artificial
  one of: forestal

origen del agua
type: DatatypeProperty
domain: Aguas quietas
range: Datatype
  one of: desconocido
  one of: epigenico
  one of: hipogenico de acuifero confinado
  one of: hipogenico de acuifero libre
  one of: hipogenico de acuifero mixto
  one of: mixto
  one of: sin catalogar

origen formacion
type: DatatypeProperty
domain: Aguas quietas
range: Datatype
  one of: Glaciar
  one of: Karstico
  one of: Otros

permeabilidad
type: DatatypeProperty
comment: Tabla CodTipologiaSubt
domain: Agua freatica
range: Datatype
  one of: aluvial
  one of: carbonatado
  one of: desconocido
  one of: detritico
  one of: impermeable
  one of: otros

regimen
type: DatatypeProperty
comment: tabla segmentoLago columna HidroPeriodo_Cedex & Hidroperiodo Aplicar tb a segmentoRio columna Regimen
domain: Aguas corrientes
domain: Aguas quietas
range: Datatype
  one of: desconocido
  one of: permanente no fluctuante
  one of: permantene fluctuante
  one of: sin catalogar
  one of: temporal erratico
  one of: temporal estacional

riesgo
type: DatatypeProperty
comment: Tabla Masa superficial columna riesgo
domain: Agua freatica
domain: Aguas Superficiales
range: Datatype
  one of: en estudio
  one of: nulo
  one of: riesgo seguro
  one of: sin riesgo

riesgo quimico
type: DatatypeProperty
comment: tabla MasaSubterranea_Riesgo Quimico columna sustancia
domain: Agua freatica
range: string

salinidad
type: DatatypeProperty
see also: {"alto", "bajo"}
domain: Aguas de transición
domain: Aguas saladas

situacion
type: DatatypeProperty
domain: Aguas artificiales
range: Datatype
  one of: elevado
  one of: en superficie
  one of: sin clasificar
  one of: subterraneo

superficie
type: DatatypeProperty
comment: tabla Rio tiene columnan SupCuenca
domain: Aguas
domain: Cuenca fluvial
range: float

tamanyo
type: DatatypeProperty
comment: tabla segmentoLago columna Tamanno CEDEX
domain: Aguas quietas
range: float

tasa de renovacion
type: DatatypeProperty
domain: Aguas quietas
range: Datatype
  one of: alta (< 1 mes)
  one of: baja (> 1 anno)
  one of: desconocida
  one of: media
  one of: sin catalogar

tipo margen
type: DatatypeProperty
domain: Aguas corrientes naturales
range: Datatype
  one of: defendida
  one of: natural

tipologia
type: DatatypeProperty
comment: tabla SegmentoLago columna Tipo
see also: Aguas_Quietas: {"alta montanna, dimictico, aguas acidas", "alta montanna, dimictico, aguas alcalinas", "alta montanna, monomictico frio, aguas acidas", "interior en cuenca de sedimentacion no carstico, permanente, somero, no salino", "interior en cuenca de sedimentacion, carstico, aportacion mixta", "interior en cuenca de sedimentacion, carstico, hipogenico grande", "interior en cuenca de sedimentacion, carstico, hipogenico, pequenno", "interior en cuenca de sedimentacion, no carstico, permanente profundo, salino", "interior en cuenca de sedimentacion, no carstico, permanente, profundo, no salino", "interior en cuenca de sedimentacion, no carstico, permanente, somero, salino", "interior en cuenca de sedimentacion, no carstico, temporal, no salino, aguas acidas", "interior en cuenca de sedimentacion, no carstico, temporal, no salino, aguas alcalinas", "interior en cuenca de sedimentacion, no carstico, temporal, salino", "litoral en complejos dunares", "litoral tipo marjal", "media montanna, monomictico calido, aguas acidas", "media montanna, monomictico calido, aguas alcalinas", "media montanna, monomictico frio, aguas alcalinas"}
domain: Aguas quietas
domain: Agua freatica

tipologia de cauce
type: DatatypeProperty
domain: Corriente Bajo Tierra
range: Datatype
  one of: Artificial
  one of: Natural

tipologia de cobertura
type: DatatypeProperty
domain: Aguas artificiales
range: Datatype
  one of: cubierto
  one of: descubierto
  one of: sin clasificar

tipologia de surgencia
type: DatatypeProperty
domain: Surgencia
range: Datatype
  one of: difusa
  one of: puntual

tipologia fluvial
type: DatatypeProperty
comment: Tabla SegmentoRio columna Tipologia OJO!! En esta tabla aparece el codigo 80 que esta referido a Embalses
domain: Curso de agua principal
range: Datatype
  one of: ejes mediterraneo - continentales mineralizados (grandes rios mineralizados)
  one of: ejes mediterraneo - continentales poco mineralizados (grandes rios poco mineralizados)
  one of: grandes ejes en ambiente mediterraneo (grandes ejes mediterraneos)
  one of: rios de alta montanna (alta montanna)
  one of: rios de montanna humeda calcarea (montanna humeda)
  one of: rios de montanna mediterranea calcarea (montanna calcarea)
  one of: rios de montanna mediterranea silicea (montanna silicea)
  one of: rios mineralizados de baja montanna mediterranea (depresion)

uso
type: DatatypeProperty
see also: {"Abastecimientos urbanos", "Acuicultura", "Agricola y/o ganadero", "Almacenaje", "Caudales y volumenes de compensacion", "Desconocido", "Navegacion y transporte acuatico", "No se usa", "Ornamental", "Otros usos", "Otros usos industriales", "Regadios y usos agrarios", "Usos industriales para la produccion de energia", "Usos recreativos"}
domain: Agua freatica
domain: Aguas Superficiales

Abrevadero
type: Class
subclass of: Almacenamiento de agua
comment: Lugar descubierto para el almacenamiento de agua para el abastecimiento del ganado
source: Elaboración propia

Acequia
type: Class
label: Irrigation ditch @en
subclass of: Aguas artificiales
subclass of: Restriction
  on property: conduce
  all values from: Aguas corrientes naturales
source: Vazquez Maure F.; Martin Lopez J. Vocabulario de terminos geograficos. Madrid: Ministerio de Obras Publicas y Urbanismo. Instituto Geografico Nacional. 1987. 89 p. ISBN: 84-505-4929-9.
comment: Zanja o canal por donde son conducidas las aguas para el riego o para otros usos.

Acuífero
type: Class
label: Aqüífer @cat
label: Aquifer @en
label: Embalse de agua subterranea
label: Aquifère @fr
equivalent class: Restriction
  on property: se extrae para
  some values from: Class
    union of: Fuente
    union of: Pozo
equivalent class: Class
  intersection of: Restriction
    on property: permite
    all values from: Corriente Bajo Tierra
  intersection of: Restriction
    on property: permite
    min cardinality: 1
subclass of: Agua freatica
provenance: Directiva Marco del Agua. Union Europea
source: Embalse de agua subterranea - Glosario Hidrologico Internacional. UNESCO
provenance: Water Framework Directive. European Union
comment: Dit de la formació geològica en la qual s'emmagatzema i circula aigua subterrània, aprofitant la porositat del terreny que l'acull i el gradient hidràulic allà present. @cat
comment: A subsurface layer or layers of rock or other geological strata of sufficient porosity and permeability to allow either a significant flow of groundwater or the abstraction of significant quantities of groundwater. @en
comment: Una o mas capas subterraneas de roca o de otros estratos geologicos que tienen la suficiente porosidad y permeabilidad para permitir ya sea un flujo significativo de aguas subterraneas o la extraccion de cantidades significativas de aguas subterraneas
comment: Couche de terrain ou une roche, suffisamment poreuse (qui peut stocker de l'eau) et perméable (où l'eau circule librement), pour contenir une nappe d'eau souterraine. @fr

Acuitardo
type: Class
label: Aquitard @en
subclass of: Agua freatica
subclass of: Restriction
  on property: transmite
  all values from: Agua freatica
comment: Formacion geologica de naturaleza algo impermeable y semiconfinada, que transmite agua en proporcion muy pequenna en comparacion con un acuifero.
provenance: Glosario Hidrologico Internacional - UNESCO
source: Glosario Hidrologico Internacional - UNESCO

Afluente
type: Class
label: Tributary @en
equivalent class: Class
  intersection of: Restriction
    on property: es afluente de
    all values from: Aguas corrientes naturales
  intersection of: Restriction
    on property: es afluente de
    max cardinality: 1
equivalent class: Class
  intersection of: Curso de agua principal
  intersection of: Restriction
    on property: desagua en
    all values from: Curso de agua principal
comment: Arroyo o rio secundario que desemboca o desagua en otro principal.
provenance: Base Cartografica Numerica 1:25000 (BCN25) del Instituto Geografico Nacional (IGN)
source: Diccionario de la Real Academia Espannola

Aguas
type: Class
label: Waters @en
label: Masa de agua
equivalent class: Class
  union of: Aguas continentales
  union of: Aguas dulces
  union of: Aguas saladas
subclass of: Accidente hidrografico
source: Diccionario de la Real Academia Espannola
comment: Sustancia cuyas moleculas estan formadas por la combinacion de un atomo de oxigeno y dos de hidrogeno en estado liquido o solido.

Aguas continentales
type: Class
label: Inland water @en
label: Masa de agua continental
equivalent class: Class
  union of: Agua freatica
  union of: Aguas Superficiales
subclass of: Aguas
comment: All standing or flowing water on the surface of the land, and all groundwater on the landward side of the baseline from which the breadth of territorial waters is measured.
source: European Parliament and the Council of the European Union. DIRECTIVE 2000/60/EC OF THE EUROPEAN PARLIAMENT AND OF THE COUNCIL for establishing a framework for Community action in the field of water policy. Brussels, 23 October 2000. p 72.
provenance: Masa de agua continental - Nomenclator Conciso. Instituto Geografico Nacional
comment: Todas las aguas quietas o corrientes en la superficie del suelo y todas las aguas subterraneas situadas hacia tierra desde la linea que sirve de base para medir la anchura de las aguas territoriales.

Aguas corrientes
type: Class
label: Flowing waters @en
label: Cauce
label: Corriente de agua
label: Curso de agua
label: Curso fluvial
label: Flujo fluvial
equivalent class: Class
  union of: Aguas artificiales
  union of: Aguas corrientes naturales
subclass of: Aguas Superficiales
comment: Aguas continentales situadas en la superficie del suelo que tienen o pueden tener un movimiento notable y continuo a traves de un cauce de origen natural o artificial.
provenance: Corriente de agua - Glosario Hidrologico Internacional - UNESCO
provenance: Curso de agua - Data Specification. INSPIRE
provenance: Flujo fluvial - Glosario Hidrologico Internacional. UNESCO

Aguas artificiales
type: Class
label: Artificial flowing water @en
label: Aguas corrientes artificiales
label: Cauce artificial
label: Curso artificial de agua
equivalent class: Class
  union of: Acequia
  union of: Canal
  union of: Conduccion de agua
equivalent class: Class
  intersection of: Restriction
    on property: conduce
    all values from: Class
      union of: Aguas marinas
      union of: Aguas Superficiales
  intersection of: Restriction
    on property: conduce
    min cardinality: 1
subclass of: Aguas corrientes
source: Aguas artificiales - Catalogo de entidades para el Nomenclator de la Base Topografica Nacional 1:25000 (BTN25). Instituto Geografico Nacional
comment: Aguas continentales situadas en la superficie del suelo que tienen o pueden tener un movimiento notable y continuo a traves de un cauce de origen artificial.Aguas continentales situadas en la superficie del suelo que tienen o pueden tener un movimiento notable y continuo a traves de un cauce de origen artificial.
source: Cauce artificial - Catalogo de fenomenos de la Base Topografica Nacional 1:25000 (BTN25). Instituto Geografico Nacional

Aguas corrientes naturales
type: Class
label: Natural flowing water @en
label: Aguas naturales
label: Corriente de agua
label: Corriente fluvial
label: Curso natural de agua
label: Cursos de agua naturales
equivalent class: Class
  union of: Arroyo
  union of: Glaciar
  union of: Rambla
  union of: Curso de agua principal
subclass of: Aguas corrientes
subclass of: Restriction
  on property: es originado por
  some values from: Class
    union of: Glaciar
    union of: Manantial
    union of: Masa de hielo
    union of: Nacimiento
subclass of: Restriction
  on property: es alimentada por
  all values from: Class
    union of: Aguas corrientes
    union of: Aguas quietas naturales
    union of: Embalse
    union of: Manantial
subclass of: Restriction
  on property: deposita en
  some values from: Aluvión
subclass of: Restriction
  on property: desagua en
  all values from: Class
    union of: Aguas corrientes
    union of: Aguas quietas
comment: Aguas continentales situadas en la superficie del suelo que tienen o pueden tener un movimiento notable y continuo a traves de un cauce de origen natural
provenance: Aguas naturales - Catalogo de entidades para el Nomenclator de Base Topografica Nacional 1:25000 (BTN25). Instituto Geografico Nacional
provenance: Corriente de agua - Glosario Hidrologico Internacional - UNESCO

Aguas costeras
type: Class
label: Coastal water @en
subclass of: Aguas marinas
subclass of: Restriction
  on property: inunda
  some values from: Estero
subclass of: Restriction
  on property: parte de
  some values from: Mar
source: European Parliament and the Council of the European Union (2000) Directive 2000/60/EC of the European Parliament and of the Council for establishing a framework for Community action in the field of water policy. Brussels, p 72.
comment: Las aguas superficiales situadas hacia tierra desde una linea cuya totalidad de puntos se encuentra a una distancia de una milla nautica mar adentro desde el punto mas proximo de la linea de base que sirve para medir la anchura de las aguas territoriales y que se extienden, en su caso, hasta el limite exterior de las aguas de transicion.
source: Parlamento Europeo y Consejo de la Union Europea. (2000) Directiva 2000/60/CE del Parlmento Europeo y del Consejo por la que se establece un marco comunitario de actuacion en el ambito de la politica de aguas. pp 72
comment: Surface water on the landward side of a line, every point of which is at a distance of one nautical mile on the seaward side from the nearest point of the baseline from which the breadth of territorial waters is measured, extending where appropriate up to the outer limit of transitional waters.

Aguas de transición
type: Class
label: Transitional waters @en
equivalent class: Class
  intersection of: Restriction
    on property: sometida a influencia de
    some values from: Aguas dulces
  intersection of: Restriction
    on property: sometida a influencia de
    some values from: Aguas saladas
  intersection of: Restriction
    on property: sometida a influencia de
    all values from: Class
      union of: Aguas dulces
      union of: Aguas saladas
  intersection of: Restriction
    on property: parte de
    cardinality: 1
  intersection of: Restriction
    on property: sometida a influencia de
    cardinality: 2
equivalent class: Class
  union of: Caño
  union of: Estuario
  union of: Marisma
  union of: Ría
subclass of: Aguas Superficiales
comment: Bodies of surface water in the vicinity of river mouths which are partly saline in character as a result of their proximity to coastal waters but which are substantially influenced by freshwater flows.
source: Directiva Marco del Agua. Union Europea
source: European Parliament and the Council of the European Union. DIRECTIVE 2000/60/EC OF THE EUROPEAN PARLIAMENT AND OF THE COUNCIL for establishing a framework for Community action in the field of water policy. Brussels, 23 October 2000. p 72.
comment: Masas de agua superficial proximas a la desembocadura de los rios que son parcialmente salinas como consecuencia de su proximidad a las aguas costeras, pero que reciben una notable influencia de flujos de agua dulce.

Aguas dulces
type: Class
equivalent class: Class
  intersection of: Aguas
  intersection of: Class
    complement of: Aguas saladas
comment: Aguas que, independientemente de ser o no potable, tiene un contenido de sales tal que no llega a darle sabor
source: Diccionario de la Real Academia Española

Aguas marinas
type: Class
label: Sea regions @en
label: Aguas oceánicas
label: Hidrografia maritima
label: Masa de agua marina
subclass of: Aguas saladas
subclass of: Restriction
  on property: es conducido por
  some values from: Aguas artificiales
subclass of: Restriction
  on property: alimenta a
  some values from: Class
    union of: Albufera
    union of: Laguna salada
subclass of: Class
  complement of: Aguas dulces
comment: Agua de los oceanos y de los mares diferenciada del agua dulce por su salinidad y por su densidad mas fuerte resultante de contenido en sales disueltas. Tambien puede ser considerada como una zona arbitrariamente definida de aguas marinas con un conjunto de atributos constantes
provenance: Aguas oceanicas - Instituto Espannol de Oceanografia
provenance: George, P. (1991) Diccionario de Geografia. Madrid: Akal & Elaboracion propia
provenance: Hidrografia maritima - Catalogo de entidades para el Nomenclator de la Base Topografica Nacional 1:25.000 (BTN25). Instituto Geografico Nacional
provenance: Sea regions - Data Specification of INSPIRE

Aguas quietas
type: Class
label: Standing water @en
label: Superficies acuáticas
equivalent class: Class
  union of: Aguas artificiales
  union of: Aguas quietas naturales
subclass of: Aguas Superficiales
comment: Aguas continentales situadas en la superficie del suelo que no tienen un movimiento notable y continuo debido al flujo de agua a traves de un cauce de origen natural o artificial
source: Elaboracion propia
provenance: Superficies aquaticas - Catalogo de fenomenos. Proyecto GEOALEX

Aguas artificiales
type: Class
label: Artificial standing water @en
label: Aguas quietas artificiales
label: Almacenamiento de agua
label: Embalsamiento de agua
label: Masa de agua embalsada
equivalent class: Class
  union of: Almacenamiento de agua
  union of: Recinto
subclass of: Aguas quietas
provenance: Aguas artificiales - Catalogo de entidades para el Nomenclator de la Base Topografica Nacional 1:25000 (BTN25). Instituto Geografico Nacional
comment: Aguas continentales situadas en la superficie del suelo que no tienen un movimiento notable y continuo debido al flujo de agua a traves de un cauce de origen artificial
provenance: Almacenamiento de agua - Catalogo de fenomenos de la Base Topografica Nacional (BTN). Instituto Geografico Nacional
source: Elaboracion propia
provenance: Masa de agua embalsada - Nomenclator Conciso. Instituto Geografico Nacional

Aguas quietas naturales
type: Class
label: Natural standing water @en
equivalent class: Class
  union of: Charca
  union of: Lago
  union of: Laguna
  union of: Masa de hielo
subclass of: Aguas quietas
subclass of: Restriction
  on property: es alimentada por
  all values from: Aguas corrientes naturales
subclass of: Class
  intersection of: Restriction
    on property: es originado por
    some values from: Class
      union of: Arroyo
      union of: Glaciar
      union of: Manantial
      union of: Marisma
      union of: Masa de hielo
      union of: Curso de agua principal
  intersection of: Restriction
    on property: es originado por
    cardinality: 1
comment: Aguas continentales situadas en la superficie del suelo que no tienen un movimiento notable y continuo debido al flujo de agua a traves de un cauce de origen natural
source: Elaboracion propia

Aguas saladas
type: Class
subclass of: Aguas
comment: Aguas que contienen sales en mayor proporcion que las aguas normalmente destinadas a usos domesticos, agricolas o industriales
source: Diccionario de la Real Academia Espannola

Agua freatica
type: Class
label: Groundwater @en
label: Agua subterranea
label: Aguas subterraneas
label: Masa de agua subterranea
subclass of: Aguas continentales
subclass of: Restriction
  on property: es alimentada por
  all values from: Class
    intersection of: Aguas Superficiales
    intersection of: Class
      complement of: Aguas de transición
    intersection of: Class
      complement of: Aguas artificiales
    intersection of: Class
      complement of: Surgencia artificial
subclass of: Restriction
  on property: descarga en
  some values from: Zona húmeda
provenance: Agua subterranea - The Digital Geographic Information Exchange Standard (DIGEST). Digital Geographic Information Working Group (DGIWG)
comment: All water which is below the surface of the ground in the saturation zone and in direct contact with the ground or subsoil.
source: Parlamento Europeo y Consejo de la Union Europea. (2000) Directiva 2000/60/CE del Parlmento Europeo y del Consejo por la que se establece un marco comunitario de actuacion en el ambito de la politica de aguas. pp 72
provenance: Parlamento Europeo y Consejo de la Union Europea. (2000) Directiva 2000/60/CE del Parlmento Europeo y del Consejo por la que se establece un marco comunitario de actuacion en el ambito de la politica de aguas. pp 72
comment: Todas las aguas que se encuentran bajo la superficie del suelo en la zona de saturacion y en contacto directo con el suelo o el subsuelo.

Aguas Superficiales
type: Class
label: Surface water @en
label: Masa de agua superficial
equivalent class: Class
  union of: Aguas corrientes
  union of: Aguas de transición
  union of: Aguas quietas
  union of: Surgencia
subclass of: Aguas continentales
subclass of: Restriction
  on property: es distribuida
  some values from: Canal de aguas continentales
subclass of: Restriction
  on property: es transvasada
  some values from: Canal de aguas continentales
subclass of: Restriction
  on property: es distribuida
  some values from: Distribución
comment: Aguas que incluyen las aguas continentales, excepto las aguas subterraneas; las aguas de transicion y las aguas costeras, y, en lo que se refiere al estado quimico, tambien las aguas territoriales
provenance: Directiva Marco del Agua. Union Europea
source: Directiva Marco del Agua. Union Europea
source: European Parliament and the Council of the European Union. DIRECTIVE 2000/60/EC OF THE EUROPEAN PARLIAMENT AND OF THE COUNCIL for establishing a framework for Community action in the field of water policy. Brussels, 23 October 2000. p 72.
comment: Inland waters, except groundwater; transitional waters and coastal waters, except in respect of chemical status for which it shall also include territorial waters.

Aguazal
type: Class
subclass of: Ciénaga
comment: Espacio al que fluye o confluye agua y tiene caracter pantanoso, generalmente con vegetacion palustre
source: Fontanillo, E. (1986) Diccionario de Geografia. Ed. Anaya. Madrid.

Alberca
type: Class
subclass of: Almacenamiento de agua
comment: Deposito artificial de agua, con muros de fabrica, destinado al riego
source: Seco, Manuel. Diccionario del espannol actual. Madrid: Editorial Aguilar. 1999

Albufera
type: Class
subclass of: Aguas saladas
subclass of: Laguna
subclass of: Class
  intersection of: Restriction
    on property: es alimentada por
    all values from: Aguas marinas
  intersection of: Restriction
    on property: es alimentada por
    cardinality: 1
subclass of: Restriction
  on property: esta proxima a
  some values from: Aguas marinas
subclass of: Restriction
  on property: es comunicada por
  some values from: Caño
source: Diccionario de la Real Academia Española
comment: Laguna litoral, en costa baja, de agua salina o ligeramente salobre, separada del mar por una lengua o cordon de arenas

Aljibe
type: Class
label: Cistern @en
label: Cisterna
subclass of: Almacenamiento de agua
subclass of: Class
  intersection of: Restriction
    on property: almacena
    some values from: Class
      union of: Manantial
      union of: Curso de agua principal
  intersection of: Restriction
    on property: almacena
    min cardinality: 1
source: Diccionario de la Real Academia Espannola
comment: Depósito subterráneo donde se recoge y conserva el agua llovediza o la que se lleva de algún río o manantial

Aguas Internacionales
type: Class
label: Alta mar
subclass of: Aguas marinas
subclass of: Restriction
  on property: parte de
  some values from: Mar
source: Diez de Velasco, Manuel (1999) Instituciones de derecho internacional publico. Duodecima edicion. Madrid: Tecnos. 924 p. ISBN: 84-309-3446-4
comment: Todas aquellas partes del mar que no forman parte del mar territorial o de las aguas interiores, que aparecen situadas fuera de las doscientas millas.

Aluvión
type: Class
subclass of: Morfologia fluvial
subclass of: Restriction
  on property: parte de
  all values from: Class
    union of: Arroyo
    union of: Curso de agua principal
subclass of: Restriction
  on property: estaEn
  some values from: Desembocadura
subclass of: Restriction
  on property: estaEn
  cardinality: 1
comment: Suelo formado por acumulacion de detritos, tales como lodos, gravas, guijarros y arenas, depositados por las aguas en desembocaduras y cauces de los rios y arroyos
source: Vazquez Maure F.; Martin Lopez J. (1987) Vocabulario de terminos geograficos. Ed. Ministerio de Obras Publicas y Urbanismo. Instituto Geografico Nacional. Madrid. ISBN: 84-505-4929-9.

Arroyo
type: Class
label: Stream @en
label: Curso de agua secundario
subclass of: Aguas corrientes naturales
subclass of: Restriction
  on property: es alimentada por
  some values from: Class
    union of: Glaciar
    union of: Masa de hielo
subclass of: Class
  intersection of: Restriction
    on property: es almacenado en
    some values from: Embalse
  intersection of: Restriction
    on property: es almacenado en
    cardinality: 1
subclass of: Class
  intersection of: Restriction
    on property: es originado por
    some values from: Class
      union of: Glaciar
      union of: Masa de hielo
      union of: Nacimiento
  intersection of: Restriction
    on property: es originado por
    cardinality: 1
subclass of: Restriction
  on property: tiene afluente
  all values from: Aguas corrientes naturales
comment: Corriente de agua de pequenna longitud y caudal continuo pero irregular.
provenance: Curso de agua secundario - Catalogo de fenomenos. Proyecto GEOALEX
source: Vazquez Maure F.; Martin Lopez J. (1987) Vocabulario de terminos geograficos. Ed. Ministerio de Obras Publicas y Urbanismo. Instituto Geografico Nacional. Madrid. ISBN: 84-505-4929-9.

Azarbe
type: Class
subclass of: Acequia
comment: Cauce adonde van a parar por las azarbetas los sobrantes o filtraciones de los riegos.
source: Diccionario de la Real Academia Espannola de la Lengua

Balsa
type: Class
label: Pool @en
label: Balsa artificial
subclass of: Almacenamiento de agua
comment: Masa estable de agua acumulada en una depresion del terreno y utilizada especialmente con fines de regadio
source: Seco, Manuel. Diccionario del espannol actual. Madrid: Editorial Aguilar. 1999

Balsa de hielo
type: Class
subclass of: Masa de hielo
provenance: The DIgital Geographic Information Exchange STandard (DIGEST) - Feature Attribute Coding Catalogue (FACC) Data Dictionary @en

Banco de nieve
type: Class
subclass of: Masa de hielo
source: Glosario Hidrologico Internacional - UNESCO
provenance: Glosario Hidrologico Internacional - UNESCO
comment: Zona aislada de nieve, por encima o debajo de la linea de nieve regional, que puede durar a lo largo de todo el verano

Barranco
type: Class
label: Gully, Ravine @en
subclass of: Morfologia fluvial
subclass of: Restriction
  on property: parte de
  all values from: Class
    union of: Arroyo
    union of: Curso de agua principal
comment: Quiebra profunda que hacen en la tierra las corrientes de agua
source: Vazquez Maure F.; Martin Lopez J. (1987) Vocabulario de terminos geograficos. Ed. Ministerio de Obras Publicas y Urbanismo. Instituto Geografico Nacional. Madrid. ISBN: 84-505-4929-9.

Barranquillo
type: Class
subclass of: Barranco

Basines
type: Class
subclass of: Encharcamiento
subclass of: Restriction
  on property: esta proxima a
  some values from: Class
    union of: Aguas marinas
    union of: Arroyo
    union of: Curso de agua principal
provenance: Catalogo de objetos de Colombia
source: Villota, H. Geomorfologia aplicada a levantamientos edafologicos y zonificacion fisica de las tierras. IGAC. Santafe de Bogota. D.C. 1997
comment: Áreas localizadas cerca de un curso de agua y/o al mar y hace parte de la llanura de inundacion, en las cuales debido a la forma concaba que presenta, se constituye en una zona de estancamiento de agua.

Bodón
type: Class
subclass of: Charca
comment: Charca o laguna invernal que se seca en verano
source: Diccionario de la Real Academia Espannola

Brazo
type: Class
label: Branch, Channel @en
subclass of: Canal de aguas marinas
subclass of: Restriction
  on property: parte de
  some values from: Mar
comment: Canal ancho y largo del mar, que penetra tierra adentro, sin tener en cuenta sus dimensiones absolutas.
source: Vazquez Maure F.; Martin Lopez J. Vocabulario de terminos geograficos. Madrid: Ministerio de Obras Publicas y Urbanismo. Instituto Geografico Nacional. 1987. 89 p. ISBN: 84-505-4929-9.

Canal
type: Class
label: Channel @en
equivalent class: Class
  union of: Canal de aguas continentales
  union of: Canal de aguas marinas
subclass of: Aguas artificiales
subclass of: Restriction
  on property: desagua en
  some values from: Aguas
comment: Cauce artificial para conduccion de agua
source: Vazquez Maure F.; Martin Lopez J. Vocabulario de terminos geograficos. Madrid: Ministerio de Obras Publicas y Urbanismo. Instituto Geografico Nacional. 1987. 89 p. ISBN: 84-505-4929-9..

Canal de aguas continentales
type: Class
equivalent class: Class
  intersection of: Canal
  intersection of: Restriction
    on property: distribuye
    some values from: Aguas Superficiales
  intersection of: Restriction
    on property: transvasa
    some values from: Aguas Superficiales
comment: En general, cauce construido para el transvase de agua. Si la dimension lo permite pueden aprovecharse para la navegacion interior, habiendo casos en los que se construye con este fin exclusivamente.
source: Fontanillo, E. (1986) Diccionario de Geografia. Ed. Anaya. Madrid.

Canal de aguas marinas
type: Class
equivalent class: Class
  intersection of: Canal
  intersection of: Restriction
    on property: comunica con
    all values from: Aguas marinas
  intersection of: Restriction
    on property: conduce
    all values from: Aguas marinas
source: Fontanillo, E. (1986) Diccionario de Geografia. Ed. Anaya. Madrid.
comment: A relatively narrow body of water linking two larger bodies @en
source: WordNet @en
comment: Brazos de mar, mas largos que anchos, que comunican dos mares. Dicese tambien de los pasos naturales entre islas o bajios.

Canal de lago
type: Class
subclass of: Canal de aguas continentales
subclass of: Class
  intersection of: Restriction
    on property: comunica con
    some values from: Class
      union of: Lago
      union of: Laguna
  intersection of: Restriction
    on property: comunica con
    max cardinality: 2
provenance: GeoNames

Canal marino
type: Class
label: Sea channel @en
equivalent class: Class
  intersection of: Canal de aguas marinas
  intersection of: Restriction
    on property: comunica con
    some values from: Mar
  intersection of: Restriction
    on property: comunica con
    cardinality: 2
provenance: GeoNames

Canalillo
type: Class
subclass of: Canal de aguas continentales
subclass of: Restriction
  on property: conduce
  some values from: Aguas Superficiales
comment: Canal pequenno de conduccion de aguas
source: Moliner, Maria. Diccionario de uso del espannol. Madrid: Editorial Gredos. 1984. p. 1590. ISBN: 84-249-1344-2

Cañada
type: Class
subclass of: Arroyo
comment: Corriente de agua de poco caudal que suele no ser permanente.
source: Diccionario de la Real Academia de la Lengua

Caño
type: Class
subclass of: Canal de aguas marinas
subclass of: Restriction
  on property: estaEn
  some values from: Marisma
subclass of: Restriction
  on property: comunica con
  some values from: Class
    intersection of: Albufera
    intersection of: Mar
    intersection of: Marisma
comment: Corriente de agua salada. Puede ser un cauce maritimo angosto que se interna en tierra, una comunicacion entre una albufera y el mar, o un cauce despejado entre una marisma
source: Vazquez Maure F.; Martin Lopez J. (1987) Vocabulario de terminos geograficos. Ed. Ministerio de Obras Publicas y Urbanismo. Instituto Geografico Nacional. Madrid. ISBN: 84-505-4929-9.

Campo de hielo
type: Class
subclass of: Campo de Nieve
provenance: Glosario Hidrologico Internacional - UNESCO
source: Glosario Hidrologico Internacional - UNESCO
comment: Hielo en la superficie libre de una masa de agua, por ejemplo un lago o un rio

Campo de nieve
type: Class
subclass of: Campo de Nieve
provenance: Glosario Hidrologico Internacional - UNESCO
source: Glosario Hidrologico Internacional - UNESCO
comment: Nieve acumulada en el terreno.

Captación
type: Class
subclass of: Hidrónimo puntual
subclass of: Restriction
  on property: actua de emisario de
  some values from: Curso de agua principal
subclass of: Class
  intersection of: Restriction
    on property: captura
    some values from: Curso de agua principal
  intersection of: Restriction
    on property: captura
    cardinality: 2
comment: Acción y efecto de apoderarse un rio de las aguas de otro inmediato, cuando, por hallarse mas bajo o tener mayor fuerza excavadora el primero, uno de sus afluentes alcanza por su cabeza a otro del rio capturado y sirve de comunicacion o emisario entre los dos. Se conoce el fenomeno de captura por el codo brusco que presenta la unión del río capturador con el capturado
source: Novo, P.; Chicarro, F. (1957) Diccionario de Geologia y Ciencias afines. Tomo 1. Ed. Labor, S.A. Barcelona

Cascada
type: Class
label: Waterfall @en
label: Catarata
label: Salto
subclass of: Corriente
subclass of: Restriction
  on property: parte de
  all values from: Curso de agua principal
comment: Caida desde cierta altura del agua de un rio u otra corriente por brusco desnivel del cauce
source: Diccionario de la Real Academia Española

Caz
type: Class
subclass of: Acequia
comment: Canal para tomar el agua y conducirla a donde es aprovechada
source: Diccionario de la Real Academia Espannola

Charca
type: Class
label: Pool @en
subclass of: Aguas quietas naturales
subclass of: Class
  intersection of: Restriction
    on property: es originado por
    some values from: Class
      union of: Arroyo
      union of: Glaciar
      union of: Manantial
      union of: Marisma
      union of: Masa de hielo
  intersection of: Restriction
    on property: es originado por
    cardinality: 1
comment: Laguna pequenna y poco profunda
source: Seco, Manuel. Diccionario del espannol actual. Madrid: Editorial Aguilar. 1999 & Elaboracion propia

Chorrera
type: Class
subclass of: Corriente
subclass of: Restriction
  on property: parte de
  all values from: Curso de agua principal
comment: Cascada
provenance: Catalogo de fenomenos del Instituto Cartografico de Andalucia
source: Diccionario de la Real Academia Española

Chortal
type: Class
subclass of: Charca
subclass of: Class
  intersection of: Restriction
    on property: es originado por
    all values from: Manantial
  intersection of: Restriction
    on property: es originado por
    cardinality: 1
source: Diccionario de la Real Academia Espannola
comment: Lagunilla formada por un manantial poco abundante que brota en el fondo de ella

Ciénaga
type: Class
label: Zona pantanosa
subclass of: Zona húmeda
source: Elaboracion propia
comment: Terreno donde abundan charcos y cenagales

Colector
type: Class
subclass of: Conduccion de agua
comment: Caño o canal que recoge todas las aguas procedentes de un avenamiento o las sobrantes del riego
source: Diccionario de la Real Academia Española

Conduccion de agua
type: Class
label: Conducto
subclass of: Aguas artificiales
subclass of: Restriction
  on property: conduce
  some values from: Aguas Superficiales
subclass of: Restriction
  on property: desagua en
  some values from: Aguas
comment: Canal, con frecuencia cerrado, que tiene como objeto el transporte de productos liquidos
source: Fontanillo, E. (1986) Diccionario de Geografia. Ed. Anaya. Madrid.

Confluencia
type: Class
subclass of: Hidrónimo puntual
subclass of: Class
  intersection of: Restriction
    on property: conecta con
    some values from: Curso de agua principal
  intersection of: Restriction
    on property: conecta con
    cardinality: 2
comment: Union de dos corrientes fluviales
source: Vazquez Maure F.; Martin Lopez J. (1987) Vocabulario de terminos geograficos. Ed. Ministerio de Obras Publicas y Urbanismo. Instituto Geografico Nacional. Madrid. ISBN: 84-505-4929-9.

Corriente
type: Class
subclass of: Aguas corrientes
subclass of: Restriction
  on property: parte de
  all values from: Class
    union of: Lago
    union of: Curso de agua principal
provenance: Getty Thesaurus of Geographic Names @en
comment: Aguas de un rio en movimiento
source: Vazquez Maure F.; Martin Lopez J. (1987) Vocabulario de terminos geograficos. Ed. Ministerio de Obras Publicas y Urbanismo. Instituto Geografico Nacional. Madrid. ISBN: 84-505-4929-9 & Elaboracion propia

Corriente Bajo Tierra
type: Class
label: Subterranean stream @en
label: Corriente subterránea
label: Rio subterraneo
subclass of: Agua freatica
subclass of: Restriction
  on property: es originado por
  some values from: Ponor
subclass of: Restriction
  on property: origina
  some values from: Class
    union of: Acuífero
    union of: Acuitardo
comment: Aguas que se encuentran bajo la superficie del suelo en la zona de saturacion y en contacto directo con el suelo o el subsuelo que tienen o pueden tener un movimiento notable y continuo a traves de un cauce de origen natural o artificial.
provenance: Glosario Hidrologico Internacional - UNESCO

Cuenca fluvial
type: Class
label: Cuenca hidrográfica
source: Cuenca fluvial - Glosario Hidrologico Internacional. UNESCO
source: Fontanillo, E. (1986) Diccionario de Geografia. Ed. Anaya. Madrid.
comment: Todo el espacio que drena las aguas que van a parar a un determinado rio y que estos vierten a un mismo mar u oceano

Delta
type: Class
subclass of: Morfologia fluvial
subclass of: Class
  intersection of: Restriction
    on property: esta proxima a
    all values from: Desembocadura
  intersection of: Restriction
    on property: esta proxima a
    cardinality: 1
subclass of: Restriction
  on property: parte de
  all values from: Curso de agua principal
provenance: Alexandria Digital Library (ADL) Feature Type Thesaurus @en
source: Diccionario de la Real Academia Española
comment: Terreno comprendido entre los brazos de un rio en su desembocadura

Almacenamiento de agua
type: Class
label: Water tank @en
label: Depósito
label: Embalsamiento de agua
subclass of: Aguas artificiales
comment: Lugar donde se almacena algo; en los mapas suelen referirse a agua
source: Vazquez Maure F.; Martin Lopez J. (1987) Vocabulario de terminos geograficos. Ed. Ministerio de Obras Publicas y Urbanismo. Instituto Geografico

Desaguadero
type: Class
label: Drainpipe @en
label: Desagüe
equivalent class: Class
  intersection of: Restriction
    on property: vierte en
    all values from: Class
      union of: Aguas marinas
      union of: Aguas quietas
      union of: Arroyo
      union of: Curso de agua principal
  intersection of: Restriction
    on property: vierte en
    cardinality: 1
subclass of: Tubería
comment: Conducto o canal por donde se da salida a las aguas hacia el mar, otro rio o un lago
source: Diccionario de la Real Academia Espannola & Fontanillo, E. (1986) Diccionario de Geografia. Ed. Anaya. Madrid.

Desembocadura
type: Class
label: Mouth @en
subclass of: Hidrónimo puntual
subclass of: Class
  intersection of: Restriction
    on property: precedeA
    all values from: Aguas marinas
  intersection of: Restriction
    on property: sigueA
    all values from: Curso de agua principal
  intersection of: Restriction
    on property: precedeA
    cardinality: 1
  intersection of: Restriction
    on property: sigueA
    cardinality: 1
source: Diccionario de la Real Academia Española & Elaboracion propia
comment: Punto en el que finaliza el trazado de un curso fluvial. La desembocadura puede ser en otro curso fluvial, en un lago, en el mar, etc.

Distribución
type: Class
subclass of: Canal de aguas continentales
subclass of: Restriction
  on property: distribuye
  some values from: Aguas Superficiales
comment: Cauce utilizado para distribuir las aguas
source: Moliner, Maria. Diccionario de uso del espannol. Madrid: Editorial Gredos. 1984. p. 1590. ISBN: 84-249-1344-2

Dren
type: Class
equivalent class: Class
  intersection of: Conduccion de agua
  intersection of: Restriction
    on property: evacua de
    some values from: Class
      union of: Acuífero
      union of: Encharcamiento
subclass of: Conduccion de agua
subclass of: Restriction
  on property: evacua de
  some values from: Class
    union of: Acuífero
    union of: Encharcamiento
comment: Conducto o pequenno canal por el que se evacua por gravedad el agua del suelo o de un acuifero para controlar el nivel de agua.
provenance: Glosario Hidrologico Internacional - UNESCO
source: Glosario Hidrologico Internacional - UNESCO

Drenaje
type: Class
subclass of: Conduccion de agua
provenance: Catalogo de fenomenos de la Base Cartografica Numerica 1:25.000 (BCN25)
comment: Construccion destinada a la recogida, colecta y eliminacion de las aguas de cualquier espacio de inundacion.
source: Fontanillo, E. (1986) Diccionario de Geografia. Ed. Anaya. Madrid & George, P. (1991) Diccionario de Geografia. Madrid: Akal.

Efluente
type: Class
subclass of: Corriente
comment: Derivacion de un curso de agua principal o de un lago.
source: Glosario Hidrologico Internacional - UNESCO
provenance: Glosario Hidrologico Internacional - UNESCO

Embalse
type: Class
label: Reservoir @en
label: Pantano
equivalent class: Class
  intersection of: Restriction
    on property: almacena
    all values from: Class
      union of: Arroyo
      union of: Curso de agua principal
  intersection of: Restriction
    on property: parte de
    all values from: Curso de agua principal
  intersection of: Restriction
    on property: almacena
    min cardinality: 1
subclass of: Almacenamiento de agua
comment: Gran deposito que se forma artificialmente, por lo comun cerrando la boca de un valle mediante un dique o presa, y en el que se almacenan las aguas de un rio o arroyo, a fin de utilizarlas en el riego de terrenos, en el abastecimiento de poblaciones, en la produccion de energia electrica, etc.
source: Diccionario de la Real Academia Española

Estanque
type: Class
label: Pond @en
subclass of: Recinto
comment: Balsa descubierta destinada al almacenamiento de agua con fines ornamentales
source: Diccionario de la Real Academia Española

Estanque salado
type: Class
subclass of: Class
  intersection of: Aguas continentales
  intersection of: Aguas saladas

Estero
type: Class
label: Swamp @en
subclass of: Zona húmeda
subclass of: Restriction
  on property: es inundada por
  all values from: Class
    union of: Aguas marinas
    union of: Laguna
    union of: Curso de agua principal
subclass of: Class
  intersection of: Restriction
    on property: esta proxima a
    some values from: Desembocadura
  intersection of: Restriction
    on property: esta proxima a
    min cardinality: 1
source: Fontanillo, E. (1986) Diccionario de Geografia. Ed. Anaya. Madrid & Diccionario de la Real Academia Espannola
comment: Terreno bajo pantanoso que suele llenarse de agua por la filtracion de un rio o laguna cercana y que se inunda en la pleamar.

Estuario
type: Class
subclass of: Aguas de transición
comment: Ancha boca de rio, donde la depresion del cauce permite la entrada de las aguas marinas en la marea, por ello, se produce mezcla de agua dulce y salada
comment: The wide part of a river where it nears the sea; fresh and salt water mix
source: Vazquez Maure F.; Martin Lopez J. (1987) Vocabulario de terminos geograficos. Ed. Ministerio de Obras Publicas y Urbanismo. Instituto Geografico Nacional. Madrid. ISBN: 84-505-4929-9 & WordNet

Accidente hidrografico
type: Class
label: Hydrographical feature @en
label: Elemento hidrografico
label: Fenomeno hidrográfico
comment: Abstraccion de un ente que forma parte del conjunto de las aguas de un pais o region o que configura su estructura.
source: Diccionario de la Real Academia Espannola & International Organization for Standardization. ISO 19101:2002 Geographic information - Reference model.

Fuente
type: Class
subclass of: Recinto
comment: Obra de fabrica en la que se hace brotar el agua por conduccion
source: Vazquez Maure F.; Martin Lopez J. (1987) Vocabulario de terminos geograficos. Ed. Ministerio de Obras Publicas y Urbanismo. Instituto Geografico

Fuente artesana
type: Class
subclass of: Fuente natural
subclass of: Class
  intersection of: Restriction
    on property: se extrae
    all values from: Acuífero
  intersection of: Restriction
    on property: se extrae
    cardinality: 1
comment: Fuente cuya agua proviene de un acuifero artesiano, generalmente a traves de alguna fisura u otro tipo de abertura del lecho confinante que cubre el acuifero.
provenance: Glosario Hidrologico Internacional - UNESCO
source: Glosario Hidrologico Internacional - UNESCO

Fuente
type: Class
label: Fuente artificial
subclass of: Surgencia artificial
subclass of: Class
  intersection of: Restriction
    on property: es alimentada por
    all values from: Tubería
  intersection of: Restriction
    on property: es alimentada por
    cardinality: 1
comment: Obra de fabrica en la que se hace brotar el agua por conduccion
source: Vazquez Maure F.; Martin Lopez J. (1987) Vocabulario de terminos geograficos. Ed. Ministerio de Obras Publicas y Urbanismo. Instituto Geografico Nacional. Madrid. ISBN: 84-505-4929-9

Fuente natural
type: Class
label: Spring @en
label: Nacedero
subclass of: Manantial
comment: Manantial perenne de agua
source: Vazquez Maure F.; Martin Lopez J. (1987) Vocabulario de terminos geograficos. Ed. Ministerio de Obras Publicas y Urbanismo. Instituto Geografico Nacional. Madrid. ISBN: 84-505-4929-9 & Elaboracion propia

Fuente salada
type: Class
subclass of: Class
  intersection of: Aguas continentales
  intersection of: Aguas saladas

Fuente vauclusiana
type: Class
subclass of: Fuente natural
source: Glosario Hidrologico Internacional - UNESCO
provenance: Glosario Hidrologico Internacional - UNESCO
comment: Surgencia en regiones karsticas controlada por un sifon natural y que fluye de forma intermitente.

Galacho
type: Class
subclass of: Barranco
subclass of: Restriction
  on property: parte de
  all values from: Curso de agua principal
comment: Barranco que excavan las aguas al correr por las pendientes del terreno
source: Vazquez Maure F.; Martin Lopez J. (1987) Vocabulario de terminos geograficos. Ed. Ministerio de Obras Publicas y Urbanismo. Instituto Geografico Nacional. Madrid. ISBN: 84-505-4929-9.

Garganta
type: Class
subclass of: Morfologia fluvial
subclass of: Restriction
  on property: parte de
  all values from: Curso de agua principal
comment: Cauce estrecho y profundo, abierto por un rio, cuyas paredes son casi verticales
source: Vazquez Maure, F., Martin Lopez, J. (1987) Vocabulario de terminos geograficos. Ministerio de Obras Publicas y Urbanismo. Instituto Geografico Nacional

Géiser
type: Class
subclass of: Fuente natural
comment: Fuente termal intermitente que lanza periodicamente una columna de agua caliente.
provenance: GeoNames
provenance: Glosario Hidrologico Internacional - UNESCO
source: Glosario Hidrologico Internacional - UNESCO

Glaciar
type: Class
equivalent class: Class
  intersection of: Aguas corrientes naturales
  intersection of: Restriction
    on property: es alimentada por
    some values from: Masa de hielo
  intersection of: Restriction
    on property: es alimentada por
    min cardinality: 1
subclass of: Restriction
  on property: alimenta a
  some values from: Class
    union of: Arroyo
    union of: Curso de agua principal
subclass of: Restriction
  on property: origina
  some values from: Class
    union of: Ibón
    union of: Lago
    union of: Laguna
source: Diccionario de la Real Academia Española
comment: Masa de hielo acumulada en las zonas de las cordilleras por encima del limite de las nieves perpetuas y cuya parte inferior se desliza muy lentamente, como si fuese un rio de hielo

Gola
type: Class
equivalent class: Class
  intersection of: Canal de aguas marinas
  intersection of: Restriction
    on property: comunica con
    some values from: Ría
comment: Canal por donde entran los buques en ciertos puertos o rias.
source: Diccionario de la Real Academia Española

Gotera
type: Class
subclass of: Ciénaga

Guadi
type: Class
label: Wadi @en
label: Uadi
subclass of: Curso de agua principal
comment: Arroyo intermitente en el desierto
source: Novo, P.; Chicarro, F. (1957) Diccionario de geologia y ciencias afines. Tomo 1. Ed. Labor, S.A. Barcelona

Hidrónimo puntual
type: Class
label: Hydrographic point @en
label: Hydrographical feature @en
label: Otros elementos hidrograficos
subclass of: Accidente hidrografico
subclass of: Restriction
  on property: parte de
  all values from: Curso de agua principal
provenance: EuroGlobalMap
provenance: EuroRegionalMap
provenance: Otros elementos hidrograficos - Catalogo de entidades para el Nomenclator de la Base Topografica Nacional 1:25.000 (BTN25). Instituto Geografico Nacional

Humedal
type: Class
label: Wetland @en
subclass of: Surgencia natural
subclass of: Restriction
  on property: sometido a descarga por
  some values from: Agua freatica
source: Gonzalez Bernaldez, Fernando. (1992) Los paisajes del agua. Terminologia popular de los humedales. Madrid: J.M. Reyero Editor. 257 p. ISBN: 84-604-3756-6.
comment: Terreno sometido a una descarga difusa de agua subterranea sin que se manifieste forzosamente un flujo copioso de agua liquida, aunque suele ser inundable y estar generalmente cubierto de vegetacion freatofitica tipo soto o juncal

Ibón
type: Class
subclass of: Charca
subclass of: Restriction
  on property: es originado por
  all values from: Class
    union of: Glaciar
    union of: Masa de hielo
comment: Laguna alimentada por la fusion de las nieves
source: Vazquez Maure F.; Martin Lopez J. (1987) Vocabulario de terminos geograficos. Ed. Ministerio de Obras Publicas y Urbanismo. Instituto Geografico Nacional. Madrid. ISBN: 84-505-4929-9.

Isla fluvial
type: Class
label: River island @en
subclass of: Morfologia fluvial
subclass of: Restriction
  on property: parte de
  all values from: Class
    union of: Embalse
    union of: Lago
    union of: Laguna
    union of: Curso de agua principal
source: Diccionario de la Real Academia Española & Elaboración propia
comment: Porcion de tierra rodeada por las aguas de un río, laguna o embalse

Lago
type: Class
label: Lake @en
subclass of: Aguas quietas naturales
subclass of: Restriction
  on property: es originado por
  all values from: Class
    intersection of: Class
      union of: Glaciar
      union of: Curso de agua principal
    intersection of: Class
      complement of: Manantial
subclass of: Restriction
  on property: dispone de emisario
  some values from: Curso de agua principal
subclass of: Restriction
  on property: es conectado con
  some values from: Class
    union of: Mar
    union of: Curso de agua principal
source: Fontanillo, E. (1986) Diccionario de Geografia. Ed. Anaya. Madrid & Diccionario de la Real Academia Espannola
comment: Gran masa permanente de agua depositada en una depresion del terreno, aunque puede haber casos en los que el lago dispone de un rio emisario que le conecta con otro lago o con el mar.

Lago salado
type: Class
subclass of: Class
  intersection of: Aguas continentales
  intersection of: Aguas saladas

Lago subterráneo
type: Class
label: Subterranean lake @en
subclass of: Agua freatica
provenance: GeoNames

Laguna
type: Class
label: Lagoon @en
subclass of: Aguas quietas naturales
subclass of: Restriction
  on property: es originado por
  some values from: Class
    union of: Glaciar
    union of: Curso de agua principal
comment: Deposito natural de agua generalmente dulce, que hace referencia o a lagos de poca extension, o a otros que aunque de mayores dimensiones superficiales son de poca profundidad
source: Fontanillo, E. (1986) Diccionario de Geografia. Ed. Anaya. Madrid & Diccionario de la Real Academia Espannola

Laguna artificial
type: Class
subclass of: Recinto
comment: Deposito de agua realizado por el hombre donde se acumula generalmente agua dulce
comment: Diccionario de la Real Academia Espannola & Elaboracion propia

Laguna salada
type: Class
subclass of: Aguas saladas
subclass of: Laguna
subclass of: Class
  intersection of: Restriction
    on property: es alimentada por
    some values from: Aguas marinas
  intersection of: Restriction
    on property: es alimentada por
    cardinality: 1
comment: Deposito natural de agua salobre y con dimensiones reducidas
source: Diccionario de la Real Academia Española & Elaboracion propia

Lavajo
type: Class
label: Navajo
subclass of: Charca
comment: Charca de agua llovediza que rara vez se seca
source: Vazquez Maure F.; Martin Lopez J. (1987) Vocabulario de terminos geograficos. Ed. Ministerio de Obras Publicas y Urbanismo. Instituto Geografico Nacional. Madrid. ISBN: 84-505-4929-9 & Diccionario de la Real Academia Espannola

Llanura de inundación
type: Class
subclass of: Encharcamiento
source: Getty Thesaurus of Geographic Names @en

Lucio
type: Class
equivalent class: Class
  intersection of: Restriction
    on property: es originado por
    all values from: Marisma
  intersection of: Restriction
    on property: es originado por
    cardinality: 1
subclass of: Charca
source: Vazquez Maure F.; Martin Lopez J. (1987) Vocabulario de terminos geograficos. Ed. Ministerio de Obras Publicas y Urbanismo. Instituto Geografico Nacional. Madrid. ISBN: 84-505-4929-9.
comment: Laguna formada en el interior de una marisma

Madre
type: Class
subclass of: Acequia
comment: Acequia principal de la que parten o donde desaguan las hijuelas
source: Diccionario de la Real Academia Espannola

Manantial
type: Class
label: Spring @en
subclass of: Surgencia natural
subclass of: Restriction
  on property: origina
  some values from: Class
    union of: Class
      intersection of: Aguas corrientes naturales
      intersection of: Class
        complement of: Glaciar
    union of: Class
      intersection of: Aguas quietas naturales
      intersection of: Class
        complement of: Bodón
      intersection of: Class
        complement of: Ibón
      intersection of: Class
        complement of: Lavajo
      intersection of: Class
        complement of: Lucio
      intersection of: Class
        complement of: Masa de hielo
subclass of: Restriction
  on property: alimenta a
  some values from: Aguas corrientes naturales
subclass of: Restriction
  on property: origina
  some values from: Chortal
comment: Nacimiento de las aguas
source: Vazquez Maure F.; Martin Lopez J. (1987) Vocabulario de terminos geograficos. Ed. Ministerio de Obras Publicas y Urbanismo. Instituto Geografico Nacional. Madrid. ISBN: 84-505-4929-9

Manantial salado
type: Class
subclass of: Class
  intersection of: Aguas continentales
  intersection of: Aguas saladas

Mar
type: Class
label: Sea @en
equivalent class: Restriction
  on property: consta de
  some values from: Class
    union of: Aguas costeras
    union of: Aguas Internacionales
    union of: Aguas Jurisdiccionales
    union of: Zona contigua
    union of: Zona economica exclusiva
subclass of: Aguas marinas
subclass of: Restriction
  on property: alimenta a
  some values from: Albufera
subclass of: Restriction
  on property: es comunicada por
  some values from: Canal marino
comment: Masa de agua salada de gran extension, con denominacion propia y limites relativamente definidos
source: Vazquez Maure F.; Martin Lopez J. (1987) Vocabulario de terminos geograficos. Ed. Ministerio de Obras Publicas y Urbanismo. Instituto Geografico Nacional. Madrid. ISBN: 84-505-4929-9.

Aguas Jurisdiccionales
type: Class
label: Aguas Territoriales
label: Mar territorial
subclass of: Aguas marinas
subclass of: Restriction
  on property: parte de
  some values from: Mar
provenance: Catalogo de objetos de Colombia
source: Decreto Ley 2324/84 Convenio Internacional sobre derecho del mar "CONVEMAR". 1992 & Diez de Velasco, Manuel (1999) Instituciones de derecho internacional publico. Duodecima edicion. Madrid: Tecnos. 924 p. ISBN: 84-309-3446-4
comment: Zona maritima adyacente a la costa, que posee una anchura de doce millas medida desde la linea de bajamar

Marisma
type: Class
label: Marsh @en
subclass of: Aguas de transición
subclass of: Restriction
  on property: origina
  some values from: Lucio
subclass of: Restriction
  on property: es inundada por
  all values from: Class
    union of: Aguas marinas
    union of: Curso de agua principal
source: Fontanillo, E. (1986) Diccionario de Geografia. Ed. Anaya. Madrid.
comment: Terreno un poco por debajo del nivel del mar que se inunda con las aguas de la creciente marina y de los rios, o de ambas a la vez

Marjal
type: Class
subclass of: Ciénaga
provenance: The Digital Geographic Information Exchange Standard (DIGEST). Digital Geographic Information Working Group (DGIWG) @en
source: Diccionario de la Real Academia Española de la Lengua
comment: Terreno bajo y pantanoso.

Masa de agua artificial
type: Class
label: Artificial water body @en
equivalent class: Class
  union of: Aguas artificiales
subclass of: Aguas Superficiales
comment: A body of surface water created by human activity.
comment: Una masa de agua superficial creada por la actividad humana.

Masa de hielo
type: Class
subclass of: Aguas quietas naturales
subclass of: Restriction
  on property: alimenta a
  all values from: Class
    union of: Aguas corrientes naturales
    union of: Charca
    union of: Lago
    union of: Laguna
provenance: Alexandria Digital Library (ADL) Feature Type Thesaurus @en

Meandro
type: Class
subclass of: Morfologia fluvial
subclass of: Restriction
  on property: parte de
  all values from: Curso de agua principal
provenance: Glosario Hidrologico Internacional - UNESCO
source: Vazquez Maure F.; Martin Lopez J. (1987) Vocabulario de terminos geograficos. Ed. Ministerio de Obras Publicas y Urbanismo. Instituto Geografico Nacional. Madrid. ISBN: 84-505-4929-9.
comment: Curva en el curso de un ríoo, formada por la erosion y sedimentacion que causan las aguas

Nacimiento
type: Class
label: Source @en
equivalent class: Class
  intersection of: Restriction
    on property: origina
    all values from: Class
      union of: Arroyo
      union of: Curso de agua principal
  intersection of: Restriction
    on property: origina
    cardinality: 1
subclass of: Manantial
comment: Punto perteneciente al recorrido de un curso fluvial en el que se inicia su trazado
source: Vazquez Maure F.; Martin Lopez J. (1987) Vocabulario de terminos geograficos. Ed. Ministerio de Obras Publicas y Urbanismo. Instituto Geografico Nacional. Madrid. ISBN: 84-505-4929-9

Nava
type: Class
subclass of: Ciénaga
comment: Tierra sin arboles y llana, a veces pantanosa, situada entre montannas o al pie de ellas
source: Vazquez Maure F.; Martin Lopez J. (1987) Vocabulario de terminos geograficos. Ed. Ministerio de Obras Publicas y Urbanismo. Instituto Geografico Nacional. Madrid. ISBN: 84-505-4929-9 & Diccionario de la Real Academia Espannola

Campo de Nieve
type: Class
label: Ice land @en
label: Nevero
subclass of: Masa de hielo
subclass of: Restriction
  on property: origina
  some values from: Ibón
comment: Masa de nieve acumulada y compacta permanente
source: Vazquez Maure F.; Martin Lopez J. (1987) Vocabulario de terminos geograficos. Ed. Ministerio de Obras Publicas y Urbanismo. Instituto Geografico Nacional. Madrid. ISBN: 84-505-4929-9.

Océano
type: Class
label: Ocean @en
subclass of: Mar
source: Diccionario de la Real Academia Espannola
comment: Grande y dilatado mar que cubre la mayor parte de la superficie terrestre
provenance: Oceanographic geographical features - Data Specification of INSPIRE

Ojo
type: Class
subclass of: Manantial
subclass of: Class
  intersection of: Restriction
    on property: origina
    all values from: Charca
  intersection of: Restriction
    on property: origina
    min cardinality: 1
comment: Manantial potente que forma una pequenna charca
source: Vazquez Maure F.; Martin Lopez J. (1987) Vocabulario de terminos geograficos. Ed. Ministerio de Obras Publicas y Urbanismo. Instituto Geografico Nacional. Madrid. ISBN: 84-505-4929-9 & Elaboracion propia

Paúl
type: Class
subclass of: Ciénaga

Piscina
type: Class
label: Swimming pool @en
subclass of: Recinto
source: Diccionario de la Real Academia Espannola & Elaboracion propia
comment: Lugar descubierto para el almacenamiento de agua para la practica de la natacion

Playa
type: Class
label: Beach @en
subclass of: Ribera
subclass of: Restriction
  on property: estaEn
  some values from: Mar
comment: Ribera del mar formada de arenales en superficie casi plana

Playa Fluvial
type: Class
label: River Beach @en
subclass of: Ribera
subclass of: Restriction
  on property: estaEn
  some values from: Curso de agua principal
comment: Ribera de un río grande, formada de arenales en superficie casi plana

Poza
type: Class
subclass of: Morfologia fluvial
subclass of: Restriction
  on property: parte de
  all values from: Curso de agua principal
comment: Concavidad en que hay agua detenida
source: Diccionario de la Real Academia Española

Pozo
type: Class
label: Well @en
equivalent class: Class
  intersection of: Restriction
    on property: se extrae
    all values from: Agua freatica
  intersection of: Restriction
    on property: se extrae
    cardinality: 1
subclass of: Surgencia artificial
source: Descripción de Entidades Geográficas BTN25. Instituto Geográfico Nacional
comment: Lugar donde se realiza una perforación de escasa profundidad en el terreno destinada a la extracción de agua subterránea y que pueden venir acompañadas de una obra de fábrica en superficie.

Ramal
type: Class
subclass of: Acequia
comment: Derivacion de una acequia
source: Vazquez Maure F.; Martin Lopez J. Vocabulario de terminos geograficos. Madrid: Ministerio de Obras Publicas y Urbanismo. Instituto Geografico Nacional. 1987. 89 p. ISBN: 84-505-4929-9.

Rambla
type: Class
equivalent class: Class
  intersection of: Class
    intersection of: Restriction
      on property: es originado por
      some values from: Torrente
    intersection of: Restriction
      on property: es originado por
      min cardinality: 1
  intersection of: Restriction
    on property: estaEn
    all values from: Barranco
  intersection of: Restriction
    on property: tiene afluente
    all values from: Aguas corrientes naturales
subclass of: Curso de agua principal
comment: Rio de lecho muy ancho, pero casi permanentemente seco, por donde solo discurren aguas durante avenidas torrenciales
source: Vazquez Maure F.; Martin Lopez J. (1987) Vocabulario de terminos geograficos. Ed. Ministerio de Obras Publicas y Urbanismo. Instituto Geografico Nacional. Madrid. ISBN: 84-505-4929-9.

Rabión
type: Class
label: Rapids @en
label: Raudal
label: Rápida
label: Rápido
subclass of: Corriente
subclass of: Restriction
  on property: parte de
  all values from: Curso de agua principal
comment: Corriente del rio en los lugares donde por la estrechez o inclinacion del cauce se hace muy violenta e impetuosa
source: Diccionario de la Real Academia Espannola

Recinto
type: Class
subclass of: Aguas artificiales
comment: A space that has been enclosed for some purpose @en
source: WordNet @en
comment: Espacio que ha sido cercado con el proposito de contener agua

Regajo
type: Class
subclass of: Arroyo
source: Diccionario de la Real Academia Espannola
comment: Arroyo pequeño

Regato
type: Class
subclass of: Arroyo
source: Moliner, Maria. (1984) Diccionario de uso del espannol. Madrid: Editorial Gredos. pp. 1590. ISBN: 84-249-1344-2
comment: Arroyo muy pequeño

Regata
type: Class
label: Drain @en
label: Reguera
subclass of: Acequia
comment: Canal o acequia para el riego
source: Vazquez Maure F.; Martin Lopez J. Vocabulario de terminos geograficos. Madrid: Ministerio de Obras Publicas y Urbanismo. Instituto Geografico Nacional. 1987. 89 p. ISBN: 84-505-4929-9.

Reguero
type: Class
subclass of: Arroyo
comment: Corriente, a modo de chorro o de arroyo pequenno, que se hace de un liquido.
source: Diccionario de la Real Academia Española de la Lengua

Ría
type: Class
label: Ria @en
subclass of: Aguas de transición
subclass of: Restriction
  on property: es comunicada por
  some values from: Gola
comment: Parte del rio proxima a su desembocadura donde las aguas dulces se mezclan con las marinas durante la marea
source: Vazquez Maure F.; Martin Lopez J. (1987) Vocabulario de terminos geograficos. Ed. Ministerio de Obras Publicas y Urbanismo. Instituto Geografico Nacional. Madrid. ISBN: 84-505-4929-9.

Riacho
type: Class
subclass of: Arroyo
source: Diccionario de la Real Academia Española
comment: Río pequeño y de poco caudal

Riachuelo
type: Class
subclass of: Arroyo
subclass of: Restriction
  on property: es afluente de
  some values from: Curso de agua principal
comment: A natural stream of water smaller than a river (and often a tributary of a river) @en
source: WordNet @en
source: Novo, P.; Chicarro, F. (1957) Diccionario de Geologia y Ciencias afines. Tomo 1. Ed. Labor, S.A. Barcelona & Diccionario de la Real Academia Española
comment: Río pequeño y de poco caudal que con frecuencia es afluente de un río

Ribera
type: Class
label: River bank @en
label: riverbank @en
label: riverside @en
subclass of: Morfologia fluvial
subclass of: Restriction
  on property: parte de
  all values from: Class
    union of: Aguas marinas
    union of: Curso de agua principal
source: Diccionario de la Real Academia Española
comment: Margen y orilla del mar o rio.

Curso de agua principal
type: Class
label: River @en
label: Curso fluvial
label: Río
equivalent class: Class
  union of: Class
    intersection of: Restriction
      on property: desembocaEn
      all values from: Aguas marinas
    intersection of: Restriction
      on property: desembocaEn
      cardinality: 1
  union of: Restriction
    on property: desagua en
    all values from: Class
      union of: Lago
      union of: Curso de agua principal
equivalent class: Restriction
  on property: consta de
  some values from: Class
    union of: Aguas de transición
    union of: Corriente
    union of: Embalse
    union of: Hidrónimo puntual
    union of: Morfologia fluvial
subclass of: Aguas corrientes naturales
subclass of: Restriction
  on property: inunda
  all values from: Class
    union of: Marisma
    union of: Encharcamiento
    union of: Zona húmeda
subclass of: Restriction
  on property: tiene afluente
  all values from: Aguas corrientes naturales
subclass of: Restriction
  on property: actua de emisario de
  some values from: Lago
subclass of: Restriction
  on property: es capturado
  all values from: Captación
subclass of: Class
  intersection of: Restriction
    on property: es originado por
    all values from: Nacimiento
  intersection of: Restriction
    on property: es originado por
    cardinality: 1
subclass of: Restriction
  on property: puede fluir como
  some values from: Corriente Bajo Tierra
subclass of: Restriction
  on property: es almacenado en
  some values from: Embalse
subclass of: Restriction
  on property: conecta con
  some values from: Lago
subclass of: Restriction
  on property: estaEn
  some values from: Barranco
subclass of: Restriction
  on property: es alimentada por
  some values from: Class
    union of: Glaciar
    union of: Manantial
    union of: Masa de hielo
comment: A body of inland water flowing for the most part on the surface of the land but which may flow underground for part of its course. @en
provenance: River - Water Framework Directive. European Union @en
source: Water Framework Directive. European Union @en
provenance: Curso de agua principal - Catalogo de fenomenos. Proyecto GEOALEX
comment: Masa de agua continental que fluye en su mayor parte sobre la superficie del suelo, pero que puede fluir bajo tierra en parte de su curso
provenance: Río - Directiva Marco del Agua. Union Europea

Rivera
type: Class
subclass of: Arroyo
comment: Arroyo, pequeño caudal de agua continua que corre por la tierra.
source: Diccionario de la Real Academia Española

Saladar
type: Class
subclass of: Salina
subclass of: Restriction
  on property: esta proxima a
  some values from: Marisma
source: Diccionario de la Real Academia Española
provenance: Getty Thesaurus of Geographic Names @en
comment: Lagunazo en que se cuaja la sal en las marismas

Salina
type: Class
subclass of: Recinto
subclass of: Class
  intersection of: Restriction
    on property: esta proxima a
    some values from: Aguas marinas
  intersection of: Restriction
    on property: esta proxima a
    cardinality: 1
subclass of: Restriction
  on property: es alimentada por
  some values from: Class
    union of: Aguas marinas
    union of: Manantial
source: Fontanillo, E. (1986) Diccionario de Geografia. Ed. Anaya. Madrid.
comment: Terreno susceptible de recibir agua salada a voluntad, donde mediante una serie de estanques de evaporacion y cristalizacion se extraen las sales contenidas en ella. Las mas usuales son las construidas en la proximidad del mar, pero podemos encontrarlas tambien en puntos del interior de los continentes, construidas junto a fuentes de aguas salinas

Hielo esponjoso
type: Class
label: Shuga @en
label: Hielo pastoso
subclass of: Masa de hielo
comment: Acumulacion de conglomerados de hielo blanco esponjoso, de unos pocos centimetros de diametro, formados por hielo pastoso o grasoso, y a veces por hielo de fondo que emerge a la superficie
source: Glosario Hidrologico Internacional - UNESCO
provenance: Glosario Hidrologico Internacional - UNESCO

Sifón
type: Class
label: Siphon @en
subclass of: Tubería
comment: Canal cerrado o tuberia que sirve para que una conduccion atraviese un barranco, una via de comunicacion u otro obstaculo
comment: Fontanillo, E. (1986) Diccionario de Geografia. Ed. Anaya. Madrid & Vazquez Maure F.; Martin Lopez J. (1987) Vocabulario de terminos geograficos. Madrid: Ministerio de Obras Publicas y Urbanismo. Instituto Geografico Nacional. 89 p. ISBN: 84-505-4929-9.

Ponor
type: Class
label: Drain @en
label: Sumidero
subclass of: Morfologia fluvial
subclass of: Restriction
  on property: comunica con
  some values from: Class
    intersection of: Agua freatica
    intersection of: Aguas Superficiales
subclass of: Restriction
  on property: origina
  some values from: Corriente Bajo Tierra
subclass of: Restriction
  on property: alimenta a
  some values from: Acuífero
comment: Agujero o abertura en el fondo o el costado de una depresion por la que una corriente de superficie o un lago, fluye parcial o totalmente hacia el sistema karstico subterraneo.
provenance: Glosario Hidrologico Internacional - UNESCO
source: Glosario Hidrologico Internacional - UNESCO

Surgencia
type: Class
label: Source @en
equivalent class: Class
  union of: Surgencia artificial
  union of: Surgencia natural
subclass of: Aguas Superficiales
source: Lopez Marinas, Juan Manuel; Perron, Mariano (2002) Glosario y Vocabulario espannol, ingles y frances de terminos habituales en geologia aplicada a la ingenieria civil. Madrid: CIE Inversiones Editoriales Dossat 2000. 237 p. ISBN: 84-95312-55-7 & Elaboracion propia.
comment: Salida de agua a la superficie terrestre

Surgencia artificial
type: Class
equivalent class: Class
  union of: Fuente
  union of: Pozo
  union of: Boca
subclass of: Surgencia
source: Lopez Marinas, Juan Manuel; Perron, Mariano (2002) Glosario y Vocabulario espannol, ingles y frances de terminos habituales en geologia aplicada a la ingenieria civil. Madrid: CIE Inversiones Editoriales Dossat 2000. 237 p. ISBN: 84-95312-55-7 & Elaboracion propia
comment: Salida de agua a la superficie terrestre construida por el hombre.

Surgencia natural
type: Class
subclass of: Surgencia
source: Lopez Marinas, Juan Manuel; Perron, Mariano (2002) Glosario y Vocabulario espannol, ingles y frances de terminos habituales en geologia aplicada a la ingenieria civil. Madrid: CIE Inversiones Editoriales Dossat 2000. 237 p. ISBN: 84-95312-55-7 & Elaboracion propia
comment: Salida natural de agua a la superficie terrestre

Aguas termales
type: Class
label: Hot spring @en
label: Fenomenos termales
label: Fuente termal
label: Fuente termomineral
label: Terma
subclass of: Manantial
provenance: Aguas termales - EuroGlobalMap (EGM)
provenance: Aguas termales - EuroRegionalMap (ERM)
provenance: Fenomenos termales - Alexandria Digital Library (ADL) Feature Type Thesaurus
comment: Fuente cuya agua brota a una temperatura superior a la temperatura media anual del lugar en el que esta localizada
provenance: Fuente termal - Glosario Hidrologico Internacional. UNESCO
provenance: Fuente termomineral - Glosario Hidrologico Internacional. UNESCO
source: Glosario Hidrologico Internacional - UNESCO
provenance: Glosario Hidrologico Internacional - UNESCO

Boca
type: Class
label: Irrigation channel @en
label: Toma
subclass of: Surgencia artificial
source: Elaboracion propia
comment: Nacimiento, renacimiento o sumidero

Torrente
type: Class
label: Torrent @en
subclass of: Aguas corrientes naturales
subclass of: Restriction
  on property: origina
  some values from: Rambla
subclass of: Restriction
  on property: discurre sobre
  some values from: Rambla
subclass of: Restriction
  on property: es originado por
  some values from: Class
    union of: Glaciar
    union of: Masa de hielo
comment: Corriente o avenida impetuosa de aguas que sobreviene en tiempos de muchas lluvias o de rapidos deshielos
source: Diccionario de la Real Academia Espannola

Tremedal
type: Class
subclass of: Ciénaga
source: Diccionario de la Real Academia Española
comment: Terreno pantanoso, abundante en turba, cubierto de cesped, y que por su escasa consistencia retiembla cuando se anda sobre el

Tubería
type: Class
label: Pipe @en
subclass of: Conduccion de agua
subclass of: Restriction
  on property: conduce
  some values from: Aguas continentales
subclass of: Restriction
  on property: alimenta a
  some values from: Fuente
comment: A long tube made of metal or plastic that is used to carry water or oil or gas etc. @en
source: WordNet @en
comment: Conducto formado por tubos de metal o plastico utilizado para el transporte de agua.
source: Diccionario de la Real Academia Española

Vado
type: Class
subclass of: Morfologia fluvial
subclass of: Restriction
  on property: parte de
  all values from: Curso de agua principal
source: Diccionario de la Real Academia Española
comment: Lugar de un río con fondo firme, llano y poco profundo, por donde se puede pasar andando, cabalgando o en algun vehiculo

Venaje
type: Class
subclass of: Surgencia natural
comment: Conjunto de venas de agua y manantiales que dan origen a un río
source: Diccionario de la Real Academia Española

Vertiente
type: Class
subclass of: Morfologia fluvial
subclass of: Restriction
  on property: parte de
  all values from: Class
    union of: Arroyo
    union of: Curso de agua principal
comment: Pendiente por donde corre o puede correr el agua.
source: Vazquez Maure F.; Martin Lopez J. (1987) Vocabulario de terminos geograficos. Ed. Ministerio de Obras Publicas y Urbanismo. Instituto Geografico Nacional. Madrid. ISBN: 84-505-4929-9 & Diccionario de la Real Academia Española

Zona contigua
type: Class
subclass of: Aguas marinas
subclass of: Restriction
  on property: parte de
  some values from: Mar
source: Diez de Velasco, Manuel (1999) Instituciones de derecho internacional publico. Duodecima edicion. Madrid: Tecnos. 924 p. ISBN: 84-309-3446-4
comment: Zona de alta mar contigua al mar territorial que no puede extenderse mas alla de veinticuatro millas marinas contadas desde las lineas de base a, a partir de las cuales se mide la anchura del mar territorial.

Zona economica exclusiva
type: Class
subclass of: Aguas marinas
subclass of: Restriction
  on property: parte de
  some values from: Mar
source: Diez de Velasco, Manuel (1999) Instituciones de derecho internacional publico. Duodecima edicion. Madrid: Tecnos. 924 p. ISBN: 84-309-3446-4
comment: Área situada fuera del mar territorial y adyacente a este, que esta sujeta a un regimen juridico especifico y en donde terceros Estados tienen tambien determinados derechos y libertades. Para la medicion de la anchura de la zona economica se parte tambien de las lineas de base a partir de las cuales se mide la anchura del mar territorial. Son doscientas millas marinas, anchura maxima aceptada, comprenden tanto el mar territorial como la zona economica. Pero se habla generalmente de “zona adyacente al mar territorial” y, por tanto, situada fuera de este.

Encharcamiento
type: Class
label: Terreno inundable
label: Zona encharcable
equivalent class: Restriction
  on property: es inundada por
  all values from: Class
    union of: Aguas corrientes naturales
    union of: Aguas quietas naturales
    union of: Embalse
subclass of: Morfologia fluvial
source: Elaboracion propia
provenance: Terreno inundable - Catalogo de fenomenos. Proyecto GEOALEX
comment: Área susceptible de ser anegada eventualmente debido a las crecidas de rios, embalses o lagos.

Zona húmeda
type: Class
equivalent class: Class
  intersection of: Humedal
  intersection of: Class
    union of: Class
      intersection of: Restriction
        on property: es inundada por
        all values from: Aguas Superficiales
      intersection of: Restriction
        on property: es inundada por
        min cardinality: 1
    union of: Restriction
      on property: sufre descarga de
      all values from: Agua freatica
source: Gonzalez Bernaldez, Fernando. (1992) Los paisajes del agua. Terminologia popular de los humedales. Madrid: J.M. Reyero Editor. 257 p. ISBN: 84-604-3756-6.
comment: Terreno sometido a una descarga difusa de agua subterranea sin que se manifieste forzosamente un flujo copioso de agua liquida, aunque suele ser inundable y estar generalmente cubierto de vegetacion freatofitica tipo soto o juncal

Morfologia fluvial
type: Class
label: Fluvial morphology @en
label: Morfología
subclass of: Restriction
  on property: parte de
  all values from: Class
    union of: Aguas marinas
    union of: Arroyo
    union of: Embalse
    union of: Lago
    union of: Laguna
    union of: Curso de agua principal
provenance: Glosario Hidrologico Internacional - UNESCO
comment: Agrupa objetos que muestran los cambios que sufren los cuerpos de agua, por la dinamica de flujo de agua y sus propias caracteristicas como la pendiente y la topografia
provenance: Catalogo de objetos de Colombia